Build_crypto Error 1

RECOMMENDED: If you have Windows errors then we strongly recommend that you download and run this (Windows) Repair Tool.

.Error 1 make[1]: Leaving directory '/home/openssl-1.1e/crypto' Makefile:278: recipe for target 'build_crypto' failed make: *** [build_crypto] Error 1. Cygwin compiling error: "this application has requested the runtime to terminate it in an unusual way". Opening fstream with file with Unicode file.

1.0.2: configure no-cms -> make failure · Issue #221 · openssl. – Feb 2, 2015. make[2]: *** [bn_srp.o] Error 1 make[2]: *** Waiting for unfinished jobs. make[1]: *** [subdirs] Error 1 make: *** [build_crypto] Error 1 ““.

Fatal Error C1034 No Include Path Set Start Visual Studio. Go to Tools->Options and expand Projects and solutions. Select VC++ Directories from the tree and choose Include Files from the combo on the right. Sorry for my bad english. how does is mean the follow fatal in vs2005 error C1034: windows.h: no include path set. Posted 24-Jun-11 6:39am. ysgepl1.4K. Green Car Congress

c – Openssl (OS X Yosemite) Installation Make Errors – Stack Overflow – Jan 2, 2015. I'm not sure what your problem is. Using XCode 6 (6.1.1, I believe) on Yosemite 10.10.1, I was able to get openssl-1.0.1j from OpenSSL.org and.

.[cryptlib.o] Error 1 mingw32-make[1]: Leaving directory 'D:/Code/openssl-1.2a/crypto' makefile:279: recipe for target 'build_crypto' failed mingw32-make: *** [build_crypto] Error 1. so i copy the "e_os.h" file from openssl-1.0.2a root directory to "crypto" directory run it again i get a new error.

Dec 4, 2015. Error 2 make[1]: Leaving directory `/home/build/ps/openssl-1.0.1h.tar/openssl- 1.0.1h/crypto' make: *** [build_crypto] Error 1 I followed this link.

Feb 24, 2013. "I"(n),"0"(a) ^ 2 errors generated. make[2]: ** [set_key.o] Error 1 make[1]: *** [ subdirs] Error 1 make: *** [build_crypto] Error 1.

Can't build (conflicting types for 'CRYPTO_memcmp') #23. Closed leolobato opened this Issue Feb 6, 2014 · 5 comments Apply labels to this issue. Nothing to show. [cryptlib.o] Error 1 make: *** [build_crypto] Error 1.

Aug 20, 2015. [cryptlib.o] Error 1 make[1]: Выход из каталога `/tmp/openssl20150820-6329- 1g0oaeg/openssl-1.0.2d/crypto' make: *** [build_crypto] Error 1.

make[1]: Leaving directory `/home/digital/Desktop/openssl-0.9.8d/crypto' make: *** [build_crypto] Error 1. I have googled this for some time now.

not found <builtin>: recipe for target 'cryptlib.o' failed make[1]: *** [cryptlib.o] Error 127 make[1]: Leaving directory '/home/canberk/Downloads/openssl-1.2h/crypto' Makefile:285: recipe for target 'build_crypto' failed make: *** [build_crypto] Error 1. I considered it might be due to some.

Cisco Rom By Bus Error At Pc Beep – POST checkpoint codes. types of error messages are BIOS dependent and vary among BIOS manufacturers, and even in some cases among different BIOSs from the same manufacturer. The following sections list the codes used by. Feb 6, 2017. Errata note AVR.54, titled "System May Experience Inability to Boot or May Cease Operation," explains

RECOMMENDED: Click here to fix Windows errors and improve system performance