Error Reading Variable Unhandled Dwarf Expression Opcode 0xfa

RECOMMENDED: If you have Windows errors then we strongly recommend that you download and run this (Windows) Repair Tool.

. raw_output_default=<optimized out>, return_value=<error reading variable: Unhandled dwarf expression opcode. Unhandled dwarf expression opcode 0xfa>.

2015年11月4日. out>, offset=0x7ffff7fd8668, [email protected]=0, check_inherited=<error reading variable: Unhandled dwarf expression opcode 0xfa>) at.

Red Hat Bugzilla – Bug 827658 [abrt] dbus doesn't honor EINVAL: Unhandled dwarf expression opcode 0xfa: Process /usr/bin/python2.7 was killed by signal 11 (SIGSEGV)

. Inserting optical media crashes kded4 Version. self=<error reading variable: Unhandled dwarf. Unhandled dwarf expression opcode 0xfa>).

Quartz Extreme Error Fcp Quartz Extreme capable video card error – Creative Cow's Final Cut Pro forum is headed by many respected FCP professionals. – Apple Final Cut Pro Legacy Forum General requirements for DVD Studio Pro 4 also call for a G4/733MHz or faster, 8MB VRAM, 512MB RAM and AGP Quartz Extreme-compatible graphics card. This story, "Apple releases
Error C0-9422-7 Jul 15, 2016. The evaluation of C0 with the same precision than the other cycles requires a. Data are means of three biological replicates and error bars are ±. 10.1016/ S0031-9422(97)00877-7 [Cross Ref]; Fahey J. W., Stephenson. Error Java Heap Space Netbeans Error Code 2 Since Destiny 2 launched, players have been running into numerous

Apr 26, 2013. self=<error reading variable: Unhandled dwarf expression opcode 0xfa>) at / tmp/buildd/glib2.0-2.33.12+really2.32.4/./glib/gmain.c:3141.

Hung apaches on pthread wrlocks · Issue #19 · krakjoe/apcu · GitHub – Jun 14, 2013. return_value_used=<error reading variable: Unhandled dwarf expression opcode 0xfa>, this_ptr=<error reading variable: Unhandled dwarf.

Jul 26, 2012. dev=<error reading variable: Unhandled dwarf expression opcode 0xfa>) at / build/buildd/qemu-kvm-1.1~rc+dfsg/hw/virtio-pci.c:546

Error 6500 trhere is a blinking error shown in my printer Pixma MP830 it show error 6500 in the printer's front pannel, it also shows the error in my computers screen when trying to send files to print. Page not found. The requested URL does not exist.< 830P Canon printer is showing error code 6500. Weve tried

Can anybody tell me what exactly the following segmentation fault means? Unhandled dwarf expression opcode 0x93 Its on solaris 10 i386. Any advice appreciated.

Mar 21, 2011. [patch] [entryval] fixup: Unhandled dwarf expression opcode 0xf3. default: error (_("Unhandled dwarf expression opcode 0x%x"), op);.

RECOMMENDED: Click here to fix Windows errors and improve system performance