Error While Loading Shared Libraries Libudev.so.1

Linux & Chromebooks: Installing Popcorn Time **Educational Purposes Only**

RECOMMENDED: If you have Windows errors then we strongly recommend that you download and run this (Windows) Repair Tool.

I installed Brackets on Lubuntu 13.04. When I use the command brackets to open it, I get the error: /usr/lib/brackets/Brackets: error while loading shared libraries.

Error loading shared libraries. I would receive this error: error while loading shared libraries:. Run ldd libxerces-c-3.1.so and examine the output to see if.

Downloaded intel XDK today. running fedora 23 64 bits got this error error while loading shared libraries: libudev.so.0: cannot open shared object file: No such file.

. spotify: error while loading shared libraries: libudev.so.1. libudev.so.1 not found when trying to. error while loading shared libraries: libudev.

Jun 24, 2014. Package Details: atraci-bin 0.7.0-1. atraci: error while loading shared libraries: libudev.so.0: cannot open shared object file: No such file or.

I am trying to run an exe which uses libudev.so but it gives this error : error while loading shared libraries: libudev.so.0: cannot open shared object file: No such.

Apr 28, 2015. On investigation, /var/log/syslog.1 contains: > Apr 28 07:46:34 master. error while loading shared libraries: libudev.so.0: cannot open shared.

How to solve missing libudev.so.0 library on Ubuntu 16.04 – Tutorial. – Sep 7, 2016. Popcorn-Time: error while loading shared libraries: libudev.so.0:. Ubuntu 16.04 does not shipped with libudev.so.0 package by default.

Jul 9, 2012. error while loading shared libraries: libudev.so.0: cannot open. [[email protected] linux]# ln -sf /usr/lib64/libudev.so.1.0.1 /usr/lib64/libudev.so.0.

/usr/bin/google-chrome: error while loading shared libraries: libudev.so.0: cannot open shared object file: No such file or directory. I manually.

Hp P3005n Error 49.4c02 hp laserjet p3005 error message 49.4c02 error – HP LaserJet 4350dtn Printer question SOLVED: Printer HP P3005-error 49.4C02 after restart – Fixya – Printer HP P3005-error 49.4C02 after restart /not every restart/ – HP LaserJet 4350dtn Printer question Numeric Error Codes 20 – 49 (HP LaserJet) Email HP LaserJet Error Codes 20 – 49. Below

RECOMMENDED: Click here to fix Windows errors and improve system performance