Exp-00015 Error In Row

DOCUMENTAL - HISTORIA DE LA MAFIA,DOCUMENTALES,VIDEOS,CANAL HISTORIA,VIDEO,DOCUMENTAL 2017,DISCOVERY

RECOMMENDED: If you have Windows errors then we strongly recommend that you download and run this (Windows) Repair Tool.

Nov 7, 2015. ORA-48166, error with opening ADR block file because file does not exist. EXP-00015, error on row number of table string, column string,

Nov 20, 2001. I am geting the following error while taking an export of certain tables. EXP- 00015: error on row 4529454 of table CUST_STATUS_HISTORY,

EXP-00015: error on row 6534790 of table AN041, column AARTICLE, datatype 1 / Oracle / Connected to: Oracle8 Enterprise Edition Release 8.0.5.0.0 – ProductionPL/SQL.

Update Error 9c59 ★★★ Run Time Error 3211 ★★ Fix, Clean, Repair # [ RUN TIME ERROR 3211 ] & Improve Its Performance! SPEED Up Your PC – Free Scan Now! (Recommended). -. Hp P3005n Error 49.4c02 hp laserjet p3005 error message 49.4c02 error – HP LaserJet 4350dtn Printer question SOLVED: Printer HP P3005-error 49.4C02 after restart –

May 1, 2004. exporting table BIGEXPORT EXP-00015: error on row 10660 of table BIGEXPORT, column MYCOL, datatype 96 EXP-00002: error in writing to.

Exp-00015 Error On Row Of Table Column Datatype 1 – Exp-00015 Error On Row Of Table Column Datatype 1. If database server character set is a single byte set and NLS_LANG translates Exporting database value length can.

Export Messages (EXP). EXP-00015 error on row number of table string, column string, EXP-00054 error on row number of subpartition string.

EXP-00015: error on row number of table string, column string, datatype number. Question Posted / guest. 1 Answers; 3253 Views; I also Faced. E-Mail Answers.

Feb 18, 2004. EXP-00015: error on row 10660 of table BIGEXPORT, <BR>. Tools which spool output may error if the spool file reaches 2Gb in size.

exp-00015: error on row of table column type, data type 2. – EXP-00015 error on row number of table string, error on row of column data type 96, exp-00015: error on row of table column type, data type 2,

Error While Loading Shared Libraries Libudev.so.1 I installed Brackets on Lubuntu 13.04. When I use the command brackets to open it, I get the error: /usr/lib/brackets/Brackets: error while loading shared libraries. Error loading shared libraries. I would receive this error: error while loading shared libraries:. Run ldd libxerces-c-3.1.so and examine the output to see if. Downloaded intel XDK today. running fedora
Hp P3005n Error 49.4c02 hp laserjet p3005 error message 49.4c02 error – HP LaserJet 4350dtn Printer question SOLVED: Printer HP P3005-error 49.4C02 after restart – Fixya – Printer HP P3005-error 49.4C02 after restart /not every restart/ – HP LaserJet 4350dtn Printer question Numeric Error Codes 20 – 49 (HP LaserJet) Email HP LaserJet Error Codes 20 – 49. Below

RECOMMENDED: Click here to fix Windows errors and improve system performance