Nmake Fatal Error U1077 Cl

RECOMMENDED: If you have Windows errors then we strongly recommend that you download and run this (Windows) Repair Tool.

Hi, I'm currently using a network simulator called Qualnet, which uses Microsoft Visual C++ for compilation. On my own PC, it works fine, but when I try to access the.

I am trying to install Qt evaluation version 3.3.1 and I get the following error during the installion, on step 8, when Qt build it exemples. Here is what I get : NMAKE -f Makefile Microsoft. All rights reserved. cl -c -nologo -Zm200 -W3 -MD -Od.

The given command or program called by NMAKE failed and returned the given exit code. To suppress this error and continue the NMAKE session, use the /I option, the.

Error Messages During Compilation – WebNMS – Exception: java.io.IOException: CreateProcess: nmake error=2 Compilation Failed. All rights reserved. NMAKE : fatal error U1077: 'cl.exe' : return code '0x2'.

Error Couldn’t Load Filesyscheck.cfg При запуске игры вылетает ошибка ***couldn t load image falloff_linear***. Здравствуйте, пишу вам по поводу проблемы насчёт ошибки "Error during initialization: Couldn't load fileSysCheck.cfg. Make sure Modern. Activision – Every time i want to play Call fo Duty Ghosts i have to reinstal the game because this appears, Error during initialization: Couldn’t load fileSysCheck.cfg. Make

(NMAKE : fatal error U1077: '"c:Program Files (x86. – MathWorks – Dec 15, 2015. "Make Error" Simulink Matlab R2013a (NMAKE : fatal error U1077:. (x86) microsoft visual studio 10.0vcbinamd64cl.exe"' : return code '0x2').

I am trying to compile Wireshark on Windows and I am running into the following error: NMAKE : fatal error U1077: ‘sed’ : return code ‘0x1’ I. Checking for required applications: cl: /c/Program Files/Microsoft Visual Studio 9.0/VC/BIN/cl.

Compiling the source Compile_Model_Example cl -Od -DUSE_RTMODEL -DNI_ROOTMODEL_Compile_Model. operable program or batch file. NMAKE : fatal error U1077: ‘C:Program’ : return code ‘0x1’ Stop. The make command returned.

Error Cpu Fan Failed Have System Service Immediately Feb 01, 2017  · So, greetings, I’m pretty new to windows 8, I’ve been using a legit MSDNA copy since early november. I found out windows 8 are pretty slicky and decent. Feb 28, 2003. It takes some experience to know when this type of failure is power related and. If the processor heatsink has its

Announcement (2017-05-07): www.ruby-forum.com is now read-only since I unfortunately do not have the time to support and maintain the forum any more.

When I try installing the PyQt5 on Windows using the command python configure.py I get this error: Error: Make sure you have a working Qt qmake on your PATH.

NMAKE Fatal Error U1077 – MSDN – Microsoft – C/C++ Building Reference C/C++ Build Errors NMAKE Errors U1000 through U4011. NMAKE Errors U1000 through U4011 NMAKE Fatal Error U1077. NMAKE.

I am trying to compile a.c function that gets hooked to a CFD program. When the makefile generated by the CFD program invokes "NMAKE" to.

NMAKE : fatal error U1077: return code '0xc0000135' Ask Question. NMAKE : fatal error U1077: 'cl.exe' : return code '0x1' Stop. in command prompt. 3.

Yes, you are right, this is 32 bits build. And yes, you are correct again – in order to compile x64 binaries just use Visual Studio x64 Win64 Command Prompt (2010).

It looks like the makefile does not have the path to where your compiler is installed. You might want to review the generated makefile and see what kind of.

I just got a new quad core computer and noticed that nmake is only using 1 process. I used to use make which had the switch -j4 for launching 4 processes. What is the.

I'm trying to compile QCAD (an open source CAD application which relies on Qt) from the source so I can build it for msvs2008. I've been following the instructions.

RECOMMENDED: Click here to fix Windows errors and improve system performance