Python Runtime Error Type Exceptions Assertionerror

RECOMMENDED: If you have Windows errors then we strongly recommend that you download and run this (Windows) Repair Tool.

unittest/mock.py" , line 726 , in assert_called_with raise AssertionError ( msg ). You want to write a unit test that cleanly tests if an exception is raised. assertEqual ( type ( e ), ValueError ) else : self. fail ( 'ValueError not raised' ). the use of.args , consider this interactive session with the built-in RuntimeError exception,

Page Contents. exceptions – Built-in error classes. Description. $ python exceptions_AssertionError_assert.py. TypeErrors are caused by combining the wrong type of objects, or calling a function with the wrong type of object. Used for events that happen at runtime that might cause problems. FutureWarning.

So I have been learning python for a while and the raise function and assert are(what I realised is that both of them crash the app, unlike try – except)really.

The Python Standard Library ». 6. Built-in Exceptions¶. Exceptions should be class objects. When exceptions of this type are created with a 2-tuple, the first item is available on the instance's errno attribute (it is assumed to be an error exception AssertionError¶. Raised when an assert statement fails. exception RuntimeWarning¶. Base class for warnings about dubious runtime behavior.

Copyright.txtThis computer source code is Copyright (c)2006 MindView, Inc. All Rights Reserved. Permission to use, copy, modify, and distribute this

Sep 3, 2013. :All Rights Reserved., 'NameError': <type 'exceptions. to CWI, CNRI, BeOpen. com, Zope Corporation and a cast of thousands : for supporting Python development. BaseException'>, 'pow': <built-in function pow>, 'RuntimeError': < type 'exceptions. IndentationError'>, 'AssertionError': <type 'exceptions.

I think of pytest as the run-anything, no boilerplate, no required api, use-this-unless-you-have-a-reason-not-to test framework. This is really where testi

There are two main error handling models: status codes and exceptions. Status codes can be used by any programming language. Exceptions require language/runtime support. Python supports exceptions. For example: def.

Prepare To Encode Failed With Error To complete this tutorial, you need the following: Node.js version 4.0.x or later, Prepare. (error, image); } var simulateApplyImage = function(imageData, callback) { var error = null; if (!imageData) { error = {message: ‘Apply. “With such a new company," Sexton said, "it’s trial and error.” That comes with. The warning highlights the task still facing

IronPython aims to be a fully compatible implementation of the Python language. At the same time, the value of a separate implementation than CPython is to make.

Sep 6, 2016. Model Exception: Exception occurred while running model 1152:. That function will generate a python dict which is a configuration object. numenta/numenta- apps/blob/master/htmengine/htmengine/runtime/. @rhyolight I am getting Int assertion error bcoz Flag "C" category only takes INT data-type and.

Biopython Tutorial and Cookbook Jeff Chang, Brad Chapman, Iddo Friedberg, Thomas Hamelryck, Michiel de Hoon, Peter Cock, Tiago Antao, Eric Talevich, Bartek Wilczy&#.

Raised when division or modulo by zero takes place for all numeric types. AssertionError. RuntimeError. Raised when a generated error does not fall into any category. If the expression is false, Python raises an AssertionError exception.

内建异常类可以创建子类,从而定义新的异常;程序员应该从Exception 类或它的 一个子类,而不是从BaseException 派生新的异常。有关定义异常的详细信息可以 查阅《Python 教程》中的用户定义的异常 一节。. 此异常是从RuntimeError 派生的 。. OverflowError | | +– ZeroDivisionError | +– AssertionError | +– AttributeError | +–.

ArithmeticError Base class for all errors that occur for numeric calculation. OverflowError Raised when a calculation exceeds maximum limit for a numeric type. If the expression is false, Python raises an AssertionError exception.

pytest allows you to use the standard python assert for verifying expectations and. def test_recursion_depth(): with pytest.raises(RuntimeError) as excinfo: def f(): f (). as well, you may also use two other ways to test for an expected exception:. E Use -v to get the full diff test_assert2.py:5: AssertionError ======= 1 failed in.

Note that Python doesn’t allow overloading "and", "or", and "not" keywords. TensorFlow also doesn’t allow using tensors as booleans, as it may be error.

Python’s assert statement is a debugging aid that tests a condition. If the condition is true, it does nothing and your program just continues to execute. But if the assert condition evaluates to false, it raises an AssertionError exception.

Python – All user-defined exceptions should use Exception as a base class. $ python exceptions_AssertionError. is raised when an error comes back from an os-specific function. When an arithmetic operation exceeds the limits of the.

This module provides the standard exception hierarchy. ImportError( StandardError) is raised when Python fails to import a module. used as a base class for exceptions raised when a sequence or dictionary type doesn't contain a given index or key. RuntimeError(StandardError) is used for various run-time problems,

RECOMMENDED: Click here to fix Windows errors and improve system performance